{"text_format":"2","workbook":"xlsx","n_sheets":5,"sheets":["Br.コード一覧","はじめに","記入例 ","衣料品・服飾雑貨","服飾雑貨（靴・鞄・ベルト類)"],"not_rendered":{"charts":0,"images":2,"macros":0,"external_links":0,"defined_names":5,"comments":0,"pivot_tables":0},"unopened":[],"bounds":{"document_bytes":16777216,"sheet_cells":100000,"run_cost":"one","rows_first":2000,"rows_last":500,"rows_between":2000,"halvings":0,"cell_chars":16384,"cell_head_chars":4096},"cells_cut":0,"cells_raw":0,"read":"whole","date_system":"1900"}

{"sheet":"Br.コード一覧","index":0,"n_rows":69,"n_cols":8,"rows_kept":69,"cut":false,"hidden":false,"merged":[[67,4,68,5],[0,0,0,7],[1,0,1,7],[35,6,38,6],[39,6,40,6],[41,6,45,6],[46,6,47,6],[48,6,50,6],[51,6,52,6],[53,6,55,6]]}
["(株)TSI基準対応ブランド一覧"]
["★一覧表未記載ブランドのご依頼があった場合は、一般受付としてご対応ください。ご不明な場合はご連絡ください。"]
["Br.CD","Br.略称","Br.名称","読み仮名","ディビジョン名","事業部名","セクション名","担当者"]
["131","MFO","FREE'S MART ORIGNAL","フリーズマート オリジナル","第1事業ディビジョン","bd事業部","MFMセクション","荷見"]
["121","PBD","PROPORTION BODY DRESSING","プロポーションボディードレッシング","第1事業ディビジョン","bd事業部","PBDセクション","阿部"]
["125","JJR","JILL by JILL STUART(リプロダクション)","ジルバイジル リプロダクション","第1事業ディビジョン","bd事業部","J/Jセクション","小俣"]
["017","NBB","NATURAL BEAUTY BASIC","ナチュラルビューティーベーシック","第1事業ディビジョン","NBB事業部","NBBセクション","大橋"]
["166","N/N","N.Natural Beauty Basic","エヌ. ナチュラルビューティーベーシック","第1事業ディビジョン","NBB事業部","N/Nセクション","湯本"]
["077","H/W","HUMAN WOMAN","ヒューマンウーマン","第2事業ディビジョン","SI事業部","営業統括セクション","谷村"]
["031","P/D","Pinky&Dianne","ピンキーアンドダイアン","第2事業ディビジョン","SI事業部","営業統括セクション","谷村"]
["531","ADR","ADORE","アドーア","第2事業ディビジョン","SI事業部","営業統括セクション","荷見"]
["534","PH","le PHIL","ル フィル","第2事業ディビジョン","SI事業部","営業統括セクション","大橋"]
["092","JSL","JILL STUART(LICENSE)","ジルスチュアート ライセンス","第2事業ディビジョン","SI事業部","営業統括セクション","小俣"]
["750","hLM","hueLe Museum","ヒューエルミュージアム","第2事業ディビジョン","BS/hLM事業部","hLMセクション","谷村"]
["707","ELE","ELE STOLYOF","エレ　ストリオフ","第2事業ディビジョン","BS/hLM事業部","hLMセクション","湯本"]
["535","stb","stumbly","スタンブリー","第2事業ディビジョン","BS/hLM事業部","hLMセクション","小俣"]
["630","HV","HAVEL studio","ハーヴェルスタジオ","第2事業ディビジョン","BS/hLM事業部","hLMセクション","小俣"]
["757","FLM","FLOML","フロム","第2事業ディビジョン","BS/hLM事業部","hLMセクション","小俣"]
["021","B/S","BOSCH","ボッシュ","第2事業ディビジョン","BS/hLM事業部","BSセクション","阿部"]
["578","MHW","MARGARET HOWELL Womens","マーガレットハウエル ウィメンズ","第2事業ディビジョン","AGL IB事業部","マーガレットハウエルセクション"]
["579","MHM","MARGARET HOWELL Mens","マーガレットハウエル メンズ","第2事業ディビジョン","AGL IB事業部","マーガレットハウエルセクション"]
["589","MHG","MARGARET HOWELL Household Goods","マーガレットハウエル ハウスホールドグッズ","第2事業ディビジョン","AGL IB事業部","マーガレットハウエルセクション"]
["595","MLW","MHL.WOMENS","エムエイチエル．ウィメンズ","第2事業ディビジョン","AGL IB事業部","マーガレットハウエルセクション"]
["596","MLM","MHL.MENS","エムエイチエル．メンズ","第2事業ディビジョン","AGL IB事業部","マーガレットハウエルセクション"]
["571","SPW","SUNSPEL WOMENS","サンスペル ウイメンズ","第2事業ディビジョン","AGL IB事業部","SUNSPELセクション"]
["572","SPM","SUNSPEL MENS","サンスペル メンズ","第2事業ディビジョン","AGL IB事業部","SUNSPELセクション"]
["598","D/D","Dice&Dice","ダイスアンドダイス","第2事業ディビジョン","AGL BIC事業部","GLOセクション"]
["800","SSO","SEVEN　BY　SEVEN　ORIGINAL","セブン バイ セブン オリジナル","第2事業ディビジョン","AGL BIC事業部","GLOセクション"]
["557","AGN","Quitan","キタン","第2事業ディビジョン","AGL BIC事業部","GLOセクション"]
["167","LIW","LIBRARY WOMENS","ライブラリー ウィメンズ","第2事業ディビジョン","AGL BIC事業部","YLEVセクション"]
["169","LIM","LIBRARY MENS","ライブラリー メンズ","第2事業ディビジョン","AGL BIC事業部","YLEVEセクション"]
["168","YLW","YLEVE WOMENS","イレーヴ ウィメンズ","第2事業ディビジョン","AGL BIC事業部","YLEVEセクション"]
["170","YLM","YLEVE MENS","イレーヴ メンズ","第2事業ディビジョン","AGL BIC事業部","YLEVEセクション"]
["174","LOW","LIBRARY ORIGINAL WOMEN","ライブラリー オリジナル ウィメン","第2事業ディビジョン","AGL BIC事業部","YLEVEセクション"]
["175","LOM","LIBRARY ORIGINAL MEN","ライブラリー オリジナル メン","第2事業ディビジョン","AGL BIC事業部","YLEVEセクション"]
["053","P/G","PEARLY GATES","パーリーゲイツ","第3事業ディビジョン","第1事業部","パーリーゲイツセクション","小俣"]
["055","PGL","PEARLY GATES LADIES","パーリーゲイツ レディース","第3事業ディビジョン","第1事業部",null,"小俣"]
["268","PGG","PGG","ピージージー","第3事業ディビジョン","第1事業部",null,"阿部"]
["269","PGGL","PGGL","ピージージーレディース","第3事業ディビジョン","第1事業部",null,"阿部"]
["758","MBM","MASTER BUNNY EDITION","マスターバニーエディション","第3事業ディビジョン","第1事業部","マスターバニーエディション\nセクション","阿部"]
["759","MBW","MASTER BUNNY EDITION Womens","マスターバニーエディション ウイメンズ","第3事業ディビジョン","第1事業部",null,"阿部"]
["262","J/B","JACK BUNNY by PEARLY GATES MENS","ｼﾞｬｯｸﾊﾞﾆｰ ﾊﾞｲ ﾊﾟｰﾘｰｹﾞｲﾂ ﾒﾝｽﾞ","第3事業ディビジョン","第1事業部","ジャックバニーセクション","谷村"]
["263","JBL","JACK BUNNY by PEARLY GATES LADYS","ｼﾞｬｯｸﾊﾞﾆｰ ﾊﾞｲ ﾊﾟｰﾘｰｹﾞｲﾂ ﾚﾃﾞｨｰｽ","第3事業ディビジョン","第1事業部",null,"谷村"]
["264","JJM","JACK BUNNY by PEARLY GATES JUNIOR MENS","ｼﾞｬｯｸﾊﾞﾆｰ ﾊﾞｲ ﾊﾟｰﾘｰｹﾞｲﾂ ｼﾞｭﾆｱﾒﾝｽﾞ","第3事業ディビジョン","第1事業部",null,"谷村"]
["265","JJW","JACK BUNNY by PEARLY GATES JUNIOR LADYS","ｼﾞｬｯｸﾊﾞﾆｰ ﾊﾞｲ ﾊﾟｰﾘｰｹﾞｲﾂ ｼﾞｭﾆｱﾚﾃﾞｨｰｽ","第3事業ディビジョン","第1事業部",null,"谷村"]
["266","GSS","GREEN GOLF STORE SELECT","グリーン ゴルフ ストア セレクト","第3事業ディビジョン","第1事業部",null,"谷村"]
["042","STA","ST ANDREWS","セントアンドリュース","第3事業ディビジョン","第1事業部","セントアンドリュース\nセクション","大橋"]
["043","STL","ST ANDREWS LADYS","セントアンドリュースレディース","第3事業ディビジョン","第1事業部",null,"大橋"]
["621","PIN","PING","ピン","第3事業ディビジョン","第2事業部","ピンアパレル\nセクション","湯本"]
["622","PIL","PINGL","ピンレディース","第3事業ディビジョン","第2事業部",null,"湯本"]
["623","PIB","PINGB","ピンバイイング","第3事業ディビジョン","第2事業部",null,"湯本"]
["012","NBG","New Balance Golf","ニューバランス ゴルフ","第3事業ディビジョン","第2事業部","ニューバランスゴルフ\nセクション","荷見"]
["013","NBS","New Balance","ニューバランス 仕入","第3事業ディビジョン","第2事業部",null,"荷見"]
["807","NWEL","NBB WEEKEND","エヌビービーウィークエンド","第3事業ディビジョン","第2事業部","NBBウイークエンド\nセクション","湯本"]
["808","NWEM","NBB WEEKEND MENS","エヌビービーウィークエンド メンズ","第3事業ディビジョン","第2事業部",null,"湯本"]
["809","NWEA","NBB WEEKEND ACCESSORY","エヌビービーウィークエンド アクセサリー","第3事業ディビジョン","第2事業部",null,"湯本"]
["641","GSJ","GSJ","ジーエスジェイ","第3事業ディビジョン","※事業部名なし","ソフトグッズセクション","***"]
["668","NM","nano･universe MENS(ORIGINAL)","ナノ・ユニバース メンズ（オリジナル）","※ディビジョン名なし","ナノ・ユニバース事業部","商品企画セクション"]
["669","NW","nano･universe WOMENS(ORIGINAL)","ナノ・ユニバース ウィメンズ（オリジナル）","※ディビジョン名なし","ナノ・ユニバース事業部","商品企画セクション"]
["670","NMB","nano･universe MENS(BUYING)","ナノ・ユニバース メンズ（バイイング）","※ディビジョン名なし","ナノ・ユニバース事業部","商品企画セクション"]
[671,"NWB","nano･universe WOMENS(BUYING)","ナノ・ユニバース ウィメンズ(バイイング)","※ディビジョン名なし","ナノ・ユニバース事業部","商品企画セクション"]
["672","NMO","nano･universe MENS(OUTLET)","ナノ・ユニバース メンズ (アウトレット)","※ディビジョン名なし","ナノ・ユニバース事業部","商品企画セクション"]
[673,"NWO","nano･universe WOMENS(OUTLET)","ナノ・ユニバース ウィメンズ (アウトレット)","※ディビジョン名なし","ナノ・ユニバース事業部","商品企画セクション"]
["677","NSP","nano･universe special order","ナノ・ユニバース スペシャルオーダー","※ディビジョン名なし","ナノ・ユニバース事業部","商品企画セクション"]
["600","R/B","ROSE BUD(ORIGINAL)","ローズバッド (オリジナル)","※ディビジョン名なし","R/B事業部","※セクション名なし"]
["601","R/B","ROSE BUD(BUYING)","ローズバッド (バイイング)","※ディビジョン名なし","R/B事業部","※セクション名なし"]
["604","R/B","ROSE BUD(OUTLET)","ローズバッド (アウトレット)","※ディビジョン名なし","R/B事業部OL","※セクション名なし"]
["574","AWD","and wander","アンドワンダー","(株)アンドワンダー\nグループ会社のため一般受付としてご対応ください",null,"and WANDERセクション"]
["575","AWB","and wander　BUYING","アンドワンダー バイイング",null,null,"and WANDERセクション"]

{"sheet":"はじめに","index":1,"n_rows":49,"n_cols":4,"rows_kept":49,"cut":false,"hidden":false,"merged":[[1,1,2,6]]}
[]
[null,"TSI品質基準専用　品質試験依頼書について"]
[]
[]
["◇はじめに◇"]
["　TSI品質基準で試験を行う場合は、こちらの品質試験依頼書を使用してください。"]
[]
["◇入力方法◇"]
["　「衣料品・服飾雑貨」または「服飾雑貨（靴・鞄・ベルト類）」のいずれかのシートを選択し、"]
["　赤い太枠内に必要事項を入力してください。"]
["　（ブランド略称欄に関数が設定されているため、パソコン上でのご入力をおすすめします。）"]
[]
["◇記入内容◇"]
[null,"①","依頼日","試験をご依頼された日付をご入力ください。"]
[null,"②","依頼者","指定検査機関にご依頼される方のお名前、ご住所等をご入力ください。"]
[null,"③","請求先","請求先がご依頼者と異なる場合のみ、ご入力ください。"]
[null,"④","残試料・試験片の返却","ご希望の返却に○を付けてください。"]
[null,null,null,"（試験後試験片については依頼者へ返却となります。）"]
[null,"⑤","ブランド","コードの欄にブランドコード（数字3ケタ）をご入力ください。"]
[null,null,null,"コードを入力していただければ略称は自動で入力されます。"]
[null,null,null,"※ブランド略称及びブランドコードは必ずご入力ください。"]
[null,"⑥","アイテム","該当するアイテムを選択し、チェックを入れてください。"]
[null,null,null,"該当アイテムがない場合はその他を選択し、アイテム名をご入力ください。"]
[null,"⑦","展開時期","製品の展開時期をご入力ください。"]
[null,"⑧","生地名","弊社または御社の生地名をご入力ください。"]
[null,"⑨","生地品番","弊社の生地品番をご入力ください。"]
[null,"⑩","繊維組成","提出試料の組成をご入力ください。"]
[null,"⑪","カラー","色番及び色名をご入力ください。"]
[null,"⑫","企画No.","企画番号をご入力ください。（企画NO.があればご入力ください。）"]
[null,"⑬","企画名","企画名称をご入力ください。"]
[null,"⑭","製品品番","製品品番をご入力ください。"]
[null,"⑮","使用区分","該当する項目を選択し、チェックを入れてください。"]
[null,"⑯","配色仕様","製品が配色仕様になるか否かを選択し、チェックを入れてください。"]
[null,"⑰","提出試料","該当する番号（１～６）いずれか1つを選択し、チェックを入れてください。"]
[null,"⑱","試料点数","提出試料の点数を入力してください。"]
[null,"⑲","試験項目","該当する項目を選択し、チェックを入れてください。"]
[null,"⑳","備考欄","必要に応じてご活用ください。"]
[]
["◇試験依頼の方法◇"]
["○","必要事項を入力した品質試験依頼書は2部印刷し、1部を試験試料とひとまとめにし、"]
[null,"指定検査機関へ送付またはお持込ください。もう1部は控えとしてお手元に保管してください。"]
["○","品質試験依頼書の内容に漏れや不備がある場合、確認作業の為に試験実施が遅れる可能性があります。"]
["○","試験用試料は実施する項目に必要な大きさをご用意ください。"]
[null,"（必須項目実施の場合は1色につき 織物の場合：全幅×50㎝、編物の場合：30㎝×30㎝を6枚取れる面積）"]
["○","実施する項目により試料の大きさが異なりますので、詳しい内容は検査機関にご確認ください。"]
["○","試料には表裏・たてよこを必ず明記してください。"]
["○","ブランド略称及びブランドコード、企画No、製品品番は必ずご入力ください。"]
[null,"企画No、製品品番が未決定の場合は空欄で構いません。"]
[null,"尚、ブランド略称及びブランドコードが不明の場合は、報告書等は全てご依頼者宛に返送されます。"]

{"sheet":"記入例 ","index":2,"n_rows":42,"n_cols":36,"rows_kept":42,"cut":false,"hidden":false,"merged":[[34,1,34,4],[26,0,26,35],[27,0,27,4],[27,5,27,9],[27,10,27,11],[27,12,27,16],[40,1,40,4],[40,5,40,9],[40,10,40,11],[40,17,40,20],[39,1,39,4],[39,5,39,9],[39,10,39,11],[39,17,39,21],[37,10,37,11],[36,34,36,35],[37,5,37,9],[37,17,37,19],[37,25,37,28],[37,29,37,33],[37,34,37,35],[38,5,38,11],[38,13,40,16],[38,17,38,21],[38,22,40,23],[38,24,40,24],[40,34,40,35],[40,25,40,28],[40,29,40,33],[38,25,38,28],[38,29,38,33],[38,34,38,35],[39,25,39,28],[39,29,39,33],[39,34,39,35],[34,29,34,33],[34,34,34,35],[35,1,35,4],[35,5,35,9],[35,10,35,11],[35,12,40,12],[35,13,37,16],[35,18,35,19],[35,22,37,23],[35,25,35,28],[34,5,34,9],[34,10,34,11],[34,13,34,16],[34,17,34,21],[34,22,34,23],[34,25,34,28],[35,29,35,33],[35,34,35,35],[36,1,38,4],[36,5,36,9],[36,10,36,11],[36,17,36,21],[36,25,36,28],[36,29,36,33],[32,17,32,21],[32,22,33,23],[32,25,32,28],[32,29,32,33],[32,34,32,35],[33,1,33,4],[33,5,33,9],[33,10,33,11],[33,17,33,20],[33,25,33,28],[33,29,33,33],[33,34,33,35],[27,17,27,21],[27,22,27,23],[27,24,27,28],[27,29,27,33],[27,34,27,35],[29,34,29,35],[30,0,40,0],[30,1,30,9],[30,10,30,11],[30,17,30,19],[30,25,30,28],[30,29,30,33],[30,34,30,35],[31,1,31,4],[31,5,31,9],[28,22,30,23],[28,24,37,24],[28,25,28,28],[31,29,31,33],[31,34,31,35],[32,1,32,4],[32,5,32,9],[32,10,32,11],[32,13,33,16],[23,0,24,2],[23,4,23,9],[23,12,23,17],[23,20,23,26],[24,4,24,20],[24,29,24,35],[28,13,30,16],[28,18,28,20],[31,10,31,11],[31,13,31,16],[31,17,31,21],[28,29,28,33],[28,34,28,35],[29,5,29,9],[29,10,29,11],[29,17,29,21],[29,25,29,28],[29,29,29,33],[28,0,29,4],[28,5,28,9],[28,10,28,11],[28,12,34,12],[31,22,31,23],[31,25,31,28],[21,0,22,2],[21,27,22,29],[21,30,21,31],[17,0,17,2],[17,3,17,17],[17,18,19,20],[17,21,17,35],[18,0,19,2],[18,3,18,17],[18,21,18,35],[19,3,19,17],[19,21,19,35],[21,32,21,34],[22,30,22,31],[22,32,22,34],[16,0,16,2],[16,3,16,17],[16,18,16,20],[16,21,16,35],[13,34,13,35],[14,3,14,4],[14,34,14,35],[20,0,20,2],[20,18,20,25],[20,27,20,29],[13,5,13,7],[13,8,14,10],[14,5,14,7],[13,0,14,2],[13,3,13,4],[15,0,15,2],[15,3,15,17],[15,18,15,20],[15,21,15,35],[13,30,14,31],[13,32,13,33],[14,32,14,33],[7,0,12,0],[7,1,8,2],[7,3,8,17],[7,18,12,18],[7,19,8,20],[10,1,11,2],[10,3,10,17],[10,19,11,20],[10,21,10,35],[11,3,11,17],[11,21,11,35],[7,21,8,35],[9,1,9,2],[9,3,9,9],[9,10,9,11],[9,12,9,17],[9,19,9,20],[9,21,9,27],[9,28,9,29],[9,30,9,35],[12,2,12,9],[12,11,12,17],[12,20,12,27],[12,29,12,35],[5,14,5,21],[5,22,5,26],[5,27,5,30],[5,32,5,35],[6,14,6,21],[6,22,6,26],[6,27,6,35],[0,0,0,35],[1,0,1,35],[2,0,3,19],[5,0,5,2],[5,7,5,9],[5,3,6,6],[5,10,6,13]]}
["TSI品質基準専用　品質試験依頼書 ≪衣料品・服飾雑貨≫"]
[]
["※TSI品質基準で試験を行う場合は、この用紙の太枠内を記入の上、指定の検査機関へ\nご依頼ください。",{"$nulls":22},"受付",null,null,null,"　","　","年","　","　","月",null,"　","日"]
[{"$nulls":23},"受付No."]
[]
["依頼日",null,null,"○/○",null,null,null,"UP日",{"$nulls":6},"　適用基準",{"$nulls":7},"残試料返却",{"$nulls":4},"要",null,null,null,"・","不要"]
[{"$nulls":14},"TSI",{"$nulls":7},"試験後試験片（全て）",{"$nulls":4},"依頼者へ返却"]
["依頼者","会社名",null,"㈱　○○テキスタイル",{"$nulls":14},"請求先","会社名",null,"㈱　△△商事"]
[]
[null,"部署名",null,"○○部○○課",{"$nulls":6},"担当者名",null,"○○",{"$nulls":6},"部署名",null,"△△部△△課",{"$nulls":6},"担当者名",null,"△△"]
[null,"所在地",null,"〒○○○-○○○○",{"$nulls":15},"所在地",null,"〒△△△-△△△△"]
[null,null,null,"東京都渋谷区○○○　1-1-1",{"$nulls":17},"東京都港区△△△　1-1-1"]
[null,"TEL","03-○○○○-○○○○",{"$nulls":7},"FAX","03-○○○○-○○○○",{"$nulls":7},"TEL","03-△△△△-△△△△",{"$nulls":7},"FAX","03-△△△△-△△△△"]
["ブランド",null,null,"コード ：",{"$nulls":4},"アイテム",{"$nulls":21},"展開\n時期",null,null,null,"年"]
[null,null,null,"略称　：",null,{"$f":"VLOOKUP(F14,Br.コード一覧!A3:H67,2,FALSE)","v":{"$error":"#N/A"}},{"$nulls":20},"(",null,null,")",{"$nulls":4},"DLV"]
["生地名",null,null,"　　　60/2ギャバ",{"$nulls":14},"企画№",null,null,"　　　12OFN-1"]
["生地品番",null,null,"　　　12-3456",{"$nulls":14},"企画名",null,null,"　　　ベーシックトレンチ"]
["繊維組成",null,null,"　　　コットン 100％",{"$nulls":14},"製品品番",null,null,"　　　017-2112200"]
["カラー",null,null,"　　　040 ベージュ、120 ネイビー、180 カーキ",{"$nulls":17},"　　　017-2152201"]
[]
["使用区分",null,null,"　　　　　　　　　　　　　　　　　　　　",{"$nulls":13},"　（",{"$nulls":8},"）","配色仕様"]
["提出試料",null,null,null," １．原反・原糸",{"$nulls":8}," ２．サンプル着分",{"$nulls":6}," ３．再加工　・　修正",{"$nulls":6},"試料点数",null,null,"製品",null,"　",null,null,"点"]
[{"$nulls":4}," ４．製品（カット可　・　カット不可）",{"$nulls":8}," ５．附属",{"$nulls":6}," ６．その他 （　　　　　　　）",{"$nulls":9},"生地",null,3,null,null,"点"]
["試験項目",null,null,null," 必須項目",{"$nulls":7},"獣毛混用率",{"$nulls":7},"羽毛混合率",{"$nulls":8},"リネン・ラミー混用率"]
[{"$nulls":4}," その他 （染堅　・　寸法変化率　・　物性　・ 　混用率　　　　　　　　　　　　　　）",{"$nulls":24},"特定芳香族アミン"]
[]
["試験実施項目"]
["項　目",{"$nulls":4},"方法・条件",{"$nulls":4},"点　数",null,"項　目",{"$nulls":4},"方法・条件",{"$nulls":4},"点　数",null,"項　目",{"$nulls":4},"方法・条件",{"$nulls":4},"点　数"]
["組　成",{"$nulls":4},"混用率　・　鑑別",{"$nulls":6},"寸法変化率","洗　濯",null,null,null,"（","　",null,null,"）",null,null,"物　性","滑　脱",null,null,null,"４９Ｎ　・　１１７．７Ｎ"]
[{"$nulls":5},"獣毛　・　羽毛",{"$nulls":11},"無蛍光　・　中性",{"$nulls":7},"引裂強さ"]
["染色堅ろう度","染堅パック",{"$nulls":15},"吊　・　平",null,null,null,"回",null,null,null,"引張強さ"]
[null,"耐　光",{"$nulls":11},"プレス",null,null,null,"Ｈ－２　・　Ｈ－３",{"$nulls":7},"破　裂"]
[null,"洗　濯",null,null,null,"Ａ－１　・　Ａ－２",{"$nulls":7},"商業ドライ",null,null,null,"石 ／ タ ・ 風乾",{"$nulls":7},"ピリング",null,null,null,"５Ｈ　・　１０Ｈ"]
[null,"汗",{"$nulls":19},"回",null,null,null,"スナッグ"]
[null,"摩　擦",{"$nulls":11},"ドライ",null,null,null,"Ｊ－１　・　Ｊ－２",{"$nulls":7},"パイル保持性"]
[null,"ドライ",null,null,null,"石油系",{"$nulls":6},"製品試験","耐洗濯性",null,null,null,"（",null,null,null,"）",null,null,null,"モール脱落・飛び出し"]
[null,"色泣き",null,null,null,"界面活性剤",{"$nulls":11},"無蛍光　・　中性",{"$nulls":7},"通気性"]
[{"$nulls":5},"石油系",{"$nulls":11},"吊　・　平",null,null,null,"回",null,null,null,"羽毛・中わた吹き出し"]
[{"$nulls":5},"一本どり ・ 白綿布 ・ 指定",{"$nulls":7},"耐ドライ\nクリーニング性",null,null,null,"商ドラ　石油系",{"$nulls":6},"その他","ホルマリン",null,null,null,"乳幼児　・　その他"]
[null,"水滴下",{"$nulls":15},"タンブル　・　風乾",{"$nulls":7},"特定芳香族アミン",null,null,null,"1 色毎　・　3色混"]
[null,"汗耐光",null,null,null,"ＪＩＳ　・　ATTS",{"$nulls":15},"回"]
["備考欄"]

{"sheet":"衣料品・服飾雑貨","index":3,"n_rows":42,"n_cols":36,"rows_kept":42,"cut":false,"hidden":false,"merged":[[40,1,40,4],[40,5,40,9],[40,10,40,11],[40,17,40,20],[40,25,40,28],[40,29,40,33],[38,25,38,28],[38,29,38,33],[38,34,38,35],[39,1,39,4],[39,5,39,9],[39,10,39,11],[39,17,39,21],[39,25,39,28],[39,29,39,33],[39,34,39,35],[36,34,36,35],[37,5,37,9],[37,17,37,19],[37,25,37,28],[37,29,37,33],[37,34,37,35],[38,5,38,11],[38,13,40,16],[38,17,38,21],[38,22,40,23],[38,24,40,24],[40,34,40,35],[37,10,37,11],[34,29,34,33],[34,34,34,35],[35,1,35,4],[35,5,35,9],[35,10,35,11],[35,12,40,12],[35,13,37,16],[35,18,35,19],[35,22,37,23],[35,25,35,28],[34,5,34,9],[34,10,34,11],[34,13,34,16],[34,17,34,21],[34,22,34,23],[34,25,34,28],[35,29,35,33],[35,34,35,35],[36,1,38,4],[36,5,36,9],[36,10,36,11],[36,17,36,21],[36,25,36,28],[36,29,36,33],[32,17,32,21],[32,22,33,23],[32,25,32,28],[32,29,32,33],[32,34,32,35],[33,1,33,4],[33,5,33,9],[33,10,33,11],[33,17,33,20],[33,25,33,28],[33,29,33,33],[33,34,33,35],[31,1,31,4],[31,5,31,9],[28,22,30,23],[28,24,37,24],[28,25,28,28],[28,29,28,33],[28,34,28,35],[29,5,29,9],[29,10,29,11],[29,17,29,21],[29,25,29,28],[29,29,29,33],[28,0,29,4],[28,5,28,9],[28,10,28,11],[28,12,34,12],[31,22,31,23],[31,25,31,28],[31,29,31,33],[31,34,31,35],[32,1,32,4],[32,5,32,9],[32,10,32,11],[32,13,33,16],[28,13,30,16],[28,18,28,20],[31,10,31,11],[31,13,31,16],[31,17,31,21],[34,1,34,4],[26,0,26,35],[27,0,27,4],[27,5,27,9],[27,10,27,11],[27,12,27,16],[27,17,27,21],[27,22,27,23],[27,24,27,28],[27,29,27,33],[27,34,27,35],[29,34,29,35],[30,0,40,0],[30,1,30,9],[30,10,30,11],[30,17,30,19],[30,25,30,28],[30,29,30,33],[30,34,30,35],[23,0,24,2],[23,4,23,9],[23,12,23,17],[23,20,23,26],[24,4,24,20],[24,29,24,35],[20,0,20,2],[20,18,20,25],[20,27,20,29],[20,30,20,35],[21,0,22,2],[21,27,22,29],[21,30,21,31],[21,32,21,34],[22,30,22,31],[22,32,22,34],[17,0,17,2],[17,3,17,17],[17,18,19,20],[17,21,17,35],[18,0,19,2],[18,3,18,17],[18,21,18,35],[19,3,19,17],[19,21,19,35],[16,0,16,2],[16,3,16,17],[16,18,16,20],[16,21,16,35],[13,34,13,35],[14,3,14,4],[14,34,14,35],[14,5,14,7],[13,5,13,7],[13,8,14,10],[13,0,14,2],[13,3,13,4],[15,0,15,2],[15,3,15,17],[15,18,15,20],[15,21,15,35],[13,32,13,33],[14,32,14,33],[13,30,14,31],[7,0,12,0],[7,1,8,2],[7,3,8,17],[7,18,12,18],[7,19,8,20],[10,1,11,2],[10,3,10,17],[10,19,11,20],[10,22,10,35],[11,3,11,17],[11,21,11,35],[7,21,8,35],[9,1,9,2],[9,3,9,9],[9,10,9,11],[9,12,9,17],[9,19,9,20],[9,21,9,27],[9,28,9,29],[9,30,9,35],[12,2,12,9],[12,11,12,17],[12,20,12,27],[12,29,12,35],[5,14,5,21],[5,22,5,26],[5,27,5,30],[5,32,5,35],[6,14,6,21],[6,22,6,26],[6,27,6,35],[0,0,0,35],[1,0,1,35],[2,0,3,19],[5,7,5,9],[5,10,6,13],[5,0,5,2],[5,3,6,6]]}
["TSI品質基準専用　品質試験依頼書 ≪衣料品・服飾雑貨≫"]
[]
["※TSI品質基準で試験を行う場合は、この用紙の太枠内を記入の上、指定の検査機関へ\nご依頼ください。",{"$nulls":22},"受付",null,null,null,"　","　","年","　","　","月",null,"　","日"]
[{"$nulls":23},"受付No."]
[]
["依頼日",{"$nulls":6},"UP日",{"$nulls":6},"　適用基準",{"$nulls":7},"残試料返却",{"$nulls":4},"要",null,null,null,"・","不要"]
[{"$nulls":14},"TSI",{"$nulls":7},"試験後試験片（全て）",{"$nulls":4},"依頼者へ返却"]
["依頼者","会社名",{"$nulls":16},"請求先","会社名"]
[]
[null,"部署名",{"$nulls":8},"担当者名",{"$nulls":8},"部署名",{"$nulls":8},"担当者名"]
[null,"所在地",{"$nulls":17},"所在地",null,"〒"]
[]
[null,"TEL",{"$nulls":8},"FAX",{"$nulls":8},"TEL",{"$nulls":8},"FAX"]
["ブランド",null,null,"コード ：",{"$nulls":4},"アイテム",{"$nulls":21},"展開\n時期",null,null,null,"年"]
[null,null,null,"略称　：",null,{"$f":"VLOOKUP(F14,Br.コード一覧!A3:H67,2,FALSE)","v":{"$error":"#N/A"}},{"$nulls":20},"(",null,null,")",{"$nulls":4},"DLV"]
["生地名",{"$nulls":17},"企画№"]
["生地品番",{"$nulls":17},"企画名"]
["繊維組成",{"$nulls":17},"製品品番"]
["カラー"]
[]
["使用区分",null,null,"　　　　　　　　　　　　　　　　　　　　",{"$nulls":13},"　（",{"$nulls":8},"）","配色仕様"]
["提出試料",null,null,null," １．原反・原糸",{"$nulls":8}," ２．サンプル着分",{"$nulls":6}," ３．再加工　・　修正",{"$nulls":6},"試料点数",null,null,"製品",null,"　",null,null,"点"]
[{"$nulls":4}," ４．製品（カット可　・　カット不可）",{"$nulls":8}," ５．附属",{"$nulls":6}," ６．その他 （　　　　　　　）",{"$nulls":9},"生地",{"$nulls":4},"点"]
["試験項目",null,null,null," 必須項目",{"$nulls":7},"獣毛混用率",{"$nulls":7},"羽毛混合率",{"$nulls":8},"麻（リネン・ラミー）鑑別"]
[{"$nulls":4}," その他 （染堅　・　寸法変化率　・　物性　・ 　　　　　　　　　　　　　　　　）",{"$nulls":24},"特定芳香族アミン"]
[]
["試験実施項目"]
["項　目",{"$nulls":4},"方法・条件",{"$nulls":4},"点　数",null,"項　目",{"$nulls":4},"方法・条件",{"$nulls":4},"点　数",null,"項　目",{"$nulls":4},"方法・条件",{"$nulls":4},"点　数"]
["組　成",{"$nulls":4},"混用率　・　鑑別",{"$nulls":6},"寸法変化率","洗　濯",null,null,null,"（","　",null,null,"）",null,null,"物　性","滑　脱",null,null,null,"４９Ｎ　・　１１７．７Ｎ"]
[{"$nulls":5},"獣毛　・　羽毛",{"$nulls":11},"無蛍光　・　中性",{"$nulls":7},"引裂強さ"]
["染色堅ろう度","染堅パック",{"$nulls":15},"吊　・　平",null,null,null,"回",null,null,null,"引張強さ"]
[null,"耐　光",{"$nulls":11},"プレス",null,null,null,"Ｈ－２　・　Ｈ－３",{"$nulls":7},"破　裂"]
[null,"洗　濯",null,null,null,"Ａ－１　・　Ａ－２",{"$nulls":7},"商業ドライ",null,null,null,"石油系　・　タンブル",{"$nulls":7},"ピリング",null,null,null,"５Ｈ　・　１０Ｈ"]
[null,"汗",{"$nulls":19},"回",null,null,null,"スナッグ"]
[null,"摩　擦",{"$nulls":11},"ドライ",null,null,null,"Ｊ－１　・　Ｊ－２",{"$nulls":7},"パイル保持性"]
[null,"ドライ",null,null,null,"石油系",{"$nulls":6},"製品試験","耐洗濯性",null,null,null,"（",null,null,null,"）",null,null,null,"モール脱落・飛び出し"]
[null,"色泣き",null,null,null,"界面活性剤",{"$nulls":11},"無蛍光　・　中性",{"$nulls":7},"通気性"]
[{"$nulls":5},"石油系",{"$nulls":11},"吊　・　平",null,null,null,"回",null,null,null,"羽毛・中わた吹き出し"]
[{"$nulls":5},"一本どり ・ 白綿布 ・ 指定",{"$nulls":7},"耐ドライ\nクリーニング性",null,null,null,"商ドラ　石油系",{"$nulls":6},"その他","ホルマリン",null,null,null,"乳幼児　・　その他"]
[null,"水滴下",{"$nulls":15},"タンブル",{"$nulls":7},"特定芳香族アミン",null,null,null,"1 色毎　・　3色混"]
[null,"汗耐光",null,null,null,"ＪＩＳ　・　ATTS",{"$nulls":15},"回"]
["備考欄"]

{"sheet":"服飾雑貨（靴・鞄・ベルト類)","index":4,"n_rows":38,"n_cols":36,"rows_kept":38,"cut":false,"hidden":false,"merged":[[33,1,33,4],[33,5,33,9],[33,10,33,11],[33,13,36,16],[33,17,34,21],[33,22,34,23],[33,25,33,28],[33,29,33,33],[33,34,33,35],[35,29,35,33],[35,34,35,35],[36,1,36,4],[36,5,36,9],[36,10,36,11],[36,25,36,28],[36,29,36,33],[36,34,36,35],[35,1,35,4],[35,5,35,9],[35,10,35,11],[35,17,36,21],[35,25,35,28],[34,1,34,4],[34,5,34,9],[31,25,31,28],[31,29,31,33],[31,34,31,35],[32,1,32,4],[32,5,32,9],[32,10,32,11],[32,13,32,16],[32,17,32,21],[32,22,32,23],[32,25,32,28],[32,29,32,33],[34,10,34,11],[34,25,34,28],[34,29,34,33],[34,34,34,35],[32,34,32,35],[28,25,28,28],[28,29,28,33],[28,34,28,35],[29,1,29,4],[29,5,29,9],[29,10,29,11],[29,14,29,16],[29,17,29,21],[29,22,29,23],[29,24,30,24],[29,25,29,28],[29,29,29,33],[29,34,29,35],[30,1,30,4],[30,5,30,9],[30,10,30,11],[30,14,30,16],[30,17,30,21],[30,22,30,23],[30,25,30,28],[30,29,30,33],[30,34,30,35],[26,25,26,28],[26,29,26,33],[26,34,26,35],[27,5,27,9],[27,10,27,11],[27,14,27,16],[27,17,27,21],[27,22,27,23],[27,25,27,28],[27,29,27,33],[27,34,27,35],[26,0,27,4],[26,5,26,9],[26,10,26,11],[26,12,36,12],[26,13,30,13],[26,14,26,16],[26,17,26,21],[26,22,26,23],[26,24,28,24],[28,0,36,0],[28,1,28,4],[28,5,28,9],[28,10,28,11],[28,14,28,16],[28,17,28,21],[28,22,28,23],[31,1,31,4],[31,5,31,9],[31,10,31,11],[31,13,31,16],[31,17,31,21],[31,22,31,23],[31,24,36,24],[35,22,36,23],[22,0,22,2],[22,27,22,28],[22,32,22,33],[24,0,24,35],[25,0,25,4],[25,5,25,9],[25,10,25,11],[25,12,25,16],[25,17,25,21],[25,22,25,23],[25,24,25,28],[25,29,25,33],[25,34,25,35],[20,0,21,2],[20,27,21,29],[20,30,20,31],[20,32,20,34],[21,30,21,31],[21,32,21,34],[17,0,17,2],[17,3,17,17],[17,18,19,20],[17,21,17,35],[18,0,19,2],[18,3,18,17],[18,21,18,35],[19,3,19,17],[19,21,19,35],[16,0,16,2],[16,3,16,17],[16,18,16,20],[16,21,16,35],[13,34,13,35],[14,3,14,4],[14,5,14,8],[14,16,14,26],[14,30,14,33],[14,34,14,35],[13,0,14,2],[13,3,13,4],[13,5,13,8],[13,9,14,11],[13,28,14,29],[13,30,13,33],[15,0,15,2],[15,3,15,17],[15,18,15,20],[15,21,15,35],[7,0,12,0],[7,1,8,2],[7,3,8,17],[7,18,12,18],[7,19,8,20],[7,21,8,35],[9,28,9,29],[9,30,9,35],[10,1,11,2],[10,3,10,17],[10,19,11,20],[10,22,10,35],[11,3,11,17],[11,21,11,35],[9,1,9,2],[9,3,9,9],[9,10,9,11],[9,12,9,17],[9,19,9,20],[9,21,9,27],[12,2,12,9],[12,11,12,17],[12,20,12,27],[12,29,12,35],[5,32,5,35],[5,27,5,30],[6,22,6,26],[5,22,5,26],[6,27,6,35],[6,14,6,21],[5,14,5,21],[0,0,0,35],[2,0,3,19],[5,0,5,2],[5,3,6,6],[5,7,5,9],[5,10,6,13]]}
["TSI品質基準専用　品質試験依頼書 ≪服飾雑貨（靴・鞄・ベルト類）≫"]
[]
["※TSI品質基準で試験を行う場合は、この用紙の太枠内を記入の上、指定の検査機関へ\nご依頼ください。",{"$nulls":22},"受付",null,null,null,"　","　","年","　","　","月",null,"　","日"]
[{"$nulls":23},"受付No."]
[]
["依頼日",{"$nulls":6},"UP日",{"$nulls":6},"　適用基準",{"$nulls":7},"残試料返却",{"$nulls":4},"要",null,null,null,"・","不要"]
[{"$nulls":14},"TSI",{"$nulls":7},"試験後試験片（全て）",{"$nulls":4},"依頼者へ返却"]
["依頼者","会社名",{"$nulls":16},"請求先","会社名"]
[]
[null,"部署名",{"$nulls":8},"担当者名",{"$nulls":8},"部署名",{"$nulls":8},"担当者名"]
[null,"所在地",{"$nulls":17},"所在地",null,"〒"]
[]
[null,"TEL",{"$nulls":8},"FAX",{"$nulls":8},"TEL",{"$nulls":8},"FAX"]
["ブランド",null,null,"コード ：",{"$nulls":5},"アイテム",{"$nulls":18},"展開\n時期",{"$nulls":5},"年"]
[null,null,null,"略称　：",null,{"$f":"VLOOKUP(F14,Br.コード一覧!A3:H67,2,FALSE)","v":{"$error":"#N/A"}},{"$nulls":9},"（",{"$nulls":11},"）",{"$nulls":6},"DLV"]
["生地名",{"$nulls":17},"企画№"]
["生地品番",{"$nulls":17},"企画名"]
["繊維組成",{"$nulls":17},"製品品番"]
["カラー"]
[]
["提出試料",null,null,null," １．原反・原糸",{"$nulls":8}," ２．サンプル着分",{"$nulls":6}," ３．再加工　・　修正",{"$nulls":6},"試料点数",null,null,"製品",null,"　",null,null,"点"]
[{"$nulls":4}," ４．製品（カット可　・　カット不可）",{"$nulls":8}," ５．附属",{"$nulls":6}," ６．その他 （　　　　　　　）",{"$nulls":9},"生地",{"$nulls":4},"点"]
["試験項目",null,null,null," 必須項目",{"$nulls":4}," その他 （　混率　・　染堅　・　　　　　　　　　　　　　　　　　　　　　　　　　　　）"]
[]
["試 験 実 施 項 目"]
["項　目",{"$nulls":4},"方法・条件",{"$nulls":4},"点　数",null,"項　目",{"$nulls":4},"方法・条件",{"$nulls":4},"点　数",null,"項　目",{"$nulls":4},"方法・条件",{"$nulls":4},"点　数"]
["組　成",{"$nulls":4},"混用率　・　鑑別",{"$nulls":6},"靴","引抜強度","前甲ﾊﾞﾝﾄﾞ",null,null,"引張方向（前　・　上）",{"$nulls":6},"鞄","鞄の実用試験",null,null,null,"TSI法"]
[{"$nulls":14},"ﾈｯｸﾊﾞﾝﾄﾞ",null,null,"引張方向（前　・　上）",{"$nulls":7},"縫目強さ",null,null,null,"グラブ法"]
["染色堅ろう度","耐　光",{"$nulls":12},"ﾊﾞｯｸﾊﾞﾝﾄﾞ",null,null,"引張方向（前　・　上）",{"$nulls":7},"把手の取付強度"]
[null,"洗　濯",null,null,null,"Ａ－１　・　Ａ－２",{"$nulls":8},"前はなお",null,null,"引張方向（前　・　上）",{"$nulls":6},"ベルト","製品の引張強さ"]
[null,"汗",{"$nulls":12},"後はなお",null,null,"引張方向（前　・　上）",{"$nulls":7},"屈曲試験"]
[null,"摩　擦",null,null,null,"Ⅰ形　・　Ⅱ形",{"$nulls":7},"ﾋｰﾙ衝撃強度",{"$nulls":10},"その他","ホルマリン",null,null,null,"乳幼児　・　その他"]
[null,"ドライ",null,null,null,"石油系",{"$nulls":7},"ﾋｰﾙ取付強度"]
[null,"水滴下",{"$nulls":11},"表底\n剥離強度",null,null,null,"(ｱｯﾊﾟｰ／中底）　\nと (ｳｴｯｼﾞ／ｽﾄｰﾑ)"]
[null,"水"]
[{"$nulls":17},"(ｳｴｯｼﾞ／ｽﾄｰﾑ)\nと 表底"]
[]
["備考欄"]